BDBM50533341 CHEMBL4544227
SMILES CNC(=O)Cn1c2ccccc2n(C2CCN(CC2)[C@H]2Cc3cccc4cccc2c34)c1=O
InChI Key InChIKey=PJANMOWVUZBDQF-DEOSSOPVSA-N
Data  2 KI  1 EC50
  Tab Delimited (TSV)   2D SDfile   Computed 3D by Vconf -m prep SDfile
Find this compound or compounds like it in BindingDB:
Activity Spreadsheet -- Enzyme Inhibition Constant Data from BindingDB
Found 2 hits for monomerid = 50533341
TargetNociceptin receptor(Homo sapiens (Human))
Astraea Therapeutics
Curated by ChEMBL
LigandPNGBDBM50533341(CHEMBL4544227)
Affinity DataKi:  0.210nM. Assay description: Displacement of [3H]nociceptin/orphanin FQ from recombinant human nociceptin opioid receptor expressed in HEK293 cell membranes after 60 mins
Ligand InfoPC cidPC sid
In DepthDetails ArticlePubMed
TargetNociceptin receptor(Homo sapiens (Human))
Astraea Therapeutics
Curated by ChEMBL
LigandPNGBDBM50533341(CHEMBL4544227)
Affinity DataEC50:  0.300nM. Assay description: Agonist activity at human nociceptin opioid receptor expressed in HEK293 cell membranes by GTPgamma(35)S binding assay
Ligand InfoPC cidPC sid
In DepthDetails ArticlePubMed